Target
D(3) dopamine receptor
Ligand
BDBM50533792
Substrate
Meas. Tech.
ChEMBL_1927266 (CHEMBL4430338)
EC50
0.780000±n/a nM
Citation
 Luo, DSharma, HYedlapudi, DAntonio, TReith, MEADutta, AK Novel multifunctional dopamine D Bioorg Med Chem 24:5088-5102 (2016)  
Target
Name:
D(3) dopamine receptor
Synonyms:
DOPAMINE D3 DRD3_HUMAN Dopamine D3 receptor (D3) Dopamine receptor Dopamine receptor D3
Type:
Mol. Mass.:
44243.43
Organism:
Homo sapiens (Human)
Description:
Residue:
400
  
Inhibitor
Name:
BDBM50533792
Synonyms:
CHEMBL4452046
Type:
Small organic molecule
Emp. Form.:
C22H33N3O2S
Mol. Mass.:
403.581
SMILES:
CCCN(CCCCCc1ccc(O)c(OC)c1)[C@H]1CCc2nc(N)sc2C1
: