Target
Acetylcholinesterase
Ligand
BDBM50089622
Substrate
Meas. Tech.
ChEBML_28626
IC50
101000±n/a nM
Citation
 Obata, RSunazuka, TOtoguro, KTomoda, HHarigaya, YOmura, S Synthetic conversion of ACAT inhibitor to acetylcholinesterase inhibitor. Bioorg Med Chem Lett 10:1315-6 (2000)  
Target
Name:
Acetylcholinesterase
Synonyms:
ACES_HUMAN Acetylcholinesterase (AChE) | Acetylcholinesterase (human AChE)
Type:
Enzyme
Mol. Mass.:
67792.70
Organism:
Homo sapiens (Human)
Description:
P22303
Residue:
614
  
Inhibitor
Name:
BDBM50089622
Synonyms:
3,6-Dihydroxy-4-hydroxymethyl-4,6a,12b-trimethyl-9-pyridin-2-yl-1,2,3,4,4a,5,6,6a,12a,12b-decahydro-7,10-dioxa-benzo[a]anthracene-11,12-dione | CHEMBL25524
Type:
Small organic molecule
Emp. Form.:
C25H29NO7
Mol. Mass.:
455.5003
SMILES:
CC1(CO)[C@@H](O)CC[C@@]2(C)C1C[C@H](O)[C@@]1(C)Oc3cc(oc(=O)c3C(=O)C21)-c1ccccn1
: