Target
Adenosine receptor A1
Ligand
BDBM10849
Substrate
Meas. Tech.
ChEMBL_1927899 (CHEMBL4430971)
Ki
41000±n/a nM
Citation
 Brunschweiger, AKoch, PSchlenk, MRafehi, MRadjainia, HKüppers, PHinz, SPineda, FWiese, MHockemeyer, JHeer, JDenonne, FMüller, CE 8-Substituted 1,3-dimethyltetrahydropyrazino[2,1-f]purinediones: Water-soluble adenosine receptor antagonists and monoamine oxidase B inhibitors. Bioorg Med Chem 24:5462-5480 (2016)  
Target
Name:
Adenosine receptor A1
Synonyms:
AA1R_RAT ADENOSINE A1 high Adenosine A1 receptor (A1) Adenosine receptors A1 | Adora1
Type:
Protein
Mol. Mass.:
36704.13
Organism:
Rattus norvegicus (rat)
Description:
Residue:
326
  
Inhibitor
Name:
BDBM10849
Synonyms:
1,3,7-trimethyl-2,3,6,7-tetrahydro-1H-purine-2,6-dione CHEMBL113 caffeine
Type:
Small organic molecule
Emp. Form.:
C8H10N4O2
Mol. Mass.:
194.1906
SMILES:
Cn1cnc2n(C)c(=O)n(C)c(=O)c12
: