Target
Beta-lactamase TEM
Ligand
BDBM50089775
Substrate
Meas. Tech.
ChEBML_39213
IC50
230±n/a nM
Citation
 Pfaendler, HRWeishaupt, RMeffert, H Synthesis and biological activities of an alpha-methyl and a beta-methyl carbapenem and the corresponding unsubstituted compound. Bioorg Med Chem Lett 10:1389-91 (2000)  
Target
Name:
Beta-lactamase TEM
Synonyms:
BLAT_ECOLX Beta-lactamase (TEM-1) Beta-lactamase TEM-1 Beta-lactamase TEM1D Beta-lactamase TEM1F TEM extended-spectrum beta-lactamase bla
Type:
Enzyme
Mol. Mass.:
31512.33
Organism:
Escherichia coli
Description:
P62593
Residue:
286
  
Inhibitor
Name:
BDBM50089775
Synonyms:
CHEMBL287670 | Potassium; (4S,5R,6S)-6-((R)-1-hydroxy-ethyl)-3-methoxy-4-methyl-7-oxo-1-aza-bicyclo[3.2.0]hept-2-ene-2-carboxylate
Type:
Small organic molecule
Emp. Form.:
C11H14NO5
Mol. Mass.:
240.2331
SMILES:
COC1=C(N2C([C@@H]([C@@H](C)O)C2=O)[C@@H]1C)C([O-])=O
: