Target
Beta-lactamase
Ligand
BDBM50089775
Substrate
Meas. Tech.
ChEBML_39212
IC50
82±n/a nM
Citation
 Pfaendler, HRWeishaupt, RMeffert, H Synthesis and biological activities of an alpha-methyl and a beta-methyl carbapenem and the corresponding unsubstituted compound. Bioorg Med Chem Lett 10:1389-91 (2000)  
Target
Name:
Beta-lactamase
Synonyms:
AMPC_ENTCL | ampC
Type:
PROTEIN
Mol. Mass.:
41306.67
Organism:
Enterobacter cloacae
Description:
ChEMBL_40258
Residue:
381
  
Inhibitor
Name:
BDBM50089775
Synonyms:
CHEMBL287670 | Potassium; (4S,5R,6S)-6-((R)-1-hydroxy-ethyl)-3-methoxy-4-methyl-7-oxo-1-aza-bicyclo[3.2.0]hept-2-ene-2-carboxylate
Type:
Small organic molecule
Emp. Form.:
C11H14NO5
Mol. Mass.:
240.2331
SMILES:
COC1=C(N2C([C@@H]([C@@H](C)O)C2=O)[C@@H]1C)C([O-])=O
: