Target
Group 10 secretory phospholipase A2
Ligand
BDBM50055366
Substrate
Meas. Tech.
ChEMBL_1928085 (CHEMBL4431157)
IC50
41±n/a nM
Citation
 Giordanetto, FPettersen, DStarke, INordberg, PDahlström, MKnerr, LSelmi, NRosengren, BLarsson, LOSandmark, JCastaldo, MDekker, NKarlsson, UHurt-Camejo, E Discovery of AZD2716: A Novel Secreted Phospholipase A ACS Med Chem Lett 7:884-889 (2016)  
Target
Name:
Group 10 secretory phospholipase A2
Synonyms:
Group X secretory phospholipase A2 PLA2G10
Type:
PROTEIN
Mol. Mass.:
18153.11
Organism:
Homo sapiens (Human)
Description:
ChEMBL_1442449
Residue:
165
  
Inhibitor
Name:
BDBM50055366
Synonyms:
(3-Aminooxalyl-1-benzyl-2-ethyl-1H-indol-4-yloxy)-acetic acid 2-(3-(2-amino-2-oxoacetyl)-1-benzyl-2-ethyl-1H-indol-4-yloxy)acetic acid Varespladib sodium
Type:
Small organic molecule
Emp. Form.:
C21H20N2O5
Mol. Mass.:
380.3939
SMILES:
CCc1c(C(=O)C(N)=O)c2c(OCC(O)=O)cccc2n1Cc1ccccc1
: