Target
5-hydroxytryptamine receptor 7
Ligand
BDBM50020222
Substrate
Ki
1014±n/a nM
Comments
PDSP_194
Citation
 Ruat, MTraiffort, ELeurs, RTardivel-Lacombe, JDiaz, JArrang, JMSchwartz, JC Molecular cloning, characterization, and localization of a high-affinity serotonin receptor (5-HT7) activating cAMP formation. Proc Natl Acad Sci U S A 90:8547-51 (1993)  
Target
Name:
5-hydroxytryptamine receptor 7
Synonyms:
5-HT-7 5-HT7 5-HT7S 5-hydroxytryptamine receptor 7 5HT7R_RAT GPRFO Serotonin (5-HT) receptor | Serotonin Receptor 7
Type:
G Protein-Coupled Receptor (GPCR)
Mol. Mass.:
49852.62
Organism:
Rattus norvegicus (rat)
Description:
Rat cloned 5-HT7R.
Residue:
448
  
Inhibitor
Name:
BDBM50020222
Synonyms:
(+/-)-7-(dipropylamino)-5,6,7,8-tetrahydronaphthalen-2-ol (R,S) 7-Dipropylamino-5,6,7,8-tetrahydro-naphthalen-2-ol 7-Dipropylamino-5,6,7,8-tetrahydro-naphthalen-2-ol 7-OH-DPAT 7-OH-DPAT,(-) CHEMBL1255966 | CHEMBL285755
Type:
Small organic molecule
Emp. Form.:
C16H25NO
Mol. Mass.:
247.3758
SMILES:
CCCN(CCC)C1CCc2ccc(O)cc2C1
: