Target
Calmodulin-domain protein kinase 1
Ligand
BDBM416555
Substrate
Meas. Tech.
ChEMBL_1928610 (CHEMBL4431786)
IC50
2.4±n/a nM
Citation
 Vidadala, RSRivas, KLOjo, KKHulverson, MAZambriski, JABruzual, ISchultz, TLHuang, WZhang, ZScheele, SDeRocher, AEChoi, RBarrett, LKSiddaramaiah, LKHol, WGFan, EMerritt, EAParsons, MFreiberg, GMarsh, KKempf, DJCarruthers, VBIsoherranen, NDoggett, JSVan Voorhis, WCMaly, DJ Development of an Orally Available and Central Nervous System (CNS) Penetrant Toxoplasma gondii Calcium-Dependent Protein Kinase 1 (TgCDPK1) Inhibitor with Minimal Human Ether-a-go-go-Related Gene (hERG) Activity for the Treatment of Toxoplasmosis. J Med Chem 59:6531-46 (2016)  
Target
Name:
Calmodulin-domain protein kinase 1
Synonyms:
Calmodulin-domain protein kinase 1 Calmodulin-domain protein kinase, putative
Type:
Enzyme Catalytic Domain
Mol. Mass.:
57248.42
Organism:
Toxoplasma gondii
Description:
Residue:
507
  
Inhibitor
Name:
BDBM416555
Synonyms:
US10307425, Example 21 | US10632122, Example 21
Type:
Small organic molecule
Emp. Form.:
C24H25N5O2
Mol. Mass.:
415.4876
SMILES:
Nc1ncnc2n(CC3CCOCC3)nc(-c3ccc4cc(OC5CC5)ccc4c3)c12
: