Target
Bifunctional dihydrofolate reductase-thymidylate synthase [A16V,S108T]
Ligand
BDBM50090049
Substrate
Meas. Tech.
ChEMBL_138604 (CHEMBL748154)
Ki
127±n/a nM
Citation
 Yuthavong, YVilaivan, TChareonsethakul, NKamchonwongpaisan, SSirawaraporn, WQuarrell, RLowe, G Development of a lead inhibitor for the A16V+S108T mutant of dihydrofolate reductase from the cycloguanil-resistant strain (T9/94) of Plasmodium falciparum. J Med Chem 43:2738-44 (2000)  
Target
Name:
Bifunctional dihydrofolate reductase-thymidylate synthase [A16V,S108T]
Synonyms:
Dihydrofolate Reductase-Thymidylate Synthase (DHFR-TS) Mutant A16V, S108T
Type:
Mol. Mass.:
71783.51
Organism:
Plasmodium falciparum
Description:
Q8I1R6[A16V,S108T]
Residue:
608
  
Inhibitor
Name:
BDBM50090049
Synonyms:
1-(4-Bromo-phenyl)-6-propyl-1,6-dihydro-[1,3,5]triazine-2,4-diamine | CHEMBL93888
Type:
Small organic molecule
Emp. Form.:
C12H16BrN5
Mol. Mass.:
310.193
SMILES:
CCCC1N=C(N)N=C(N)N1c1ccc(Br)cc1
: