Target
Bifunctional dihydrofolate reductase-thymidylate synthase
Ligand
BDBM50090068
Substrate
Meas. Tech.
ChEMBL_216586 (CHEMBL821378)
Ki
7.7±n/a nM
Citation
 Yuthavong, YVilaivan, TChareonsethakul, NKamchonwongpaisan, SSirawaraporn, WQuarrell, RLowe, G Development of a lead inhibitor for the A16V+S108T mutant of dihydrofolate reductase from the cycloguanil-resistant strain (T9/94) of Plasmodium falciparum. J Med Chem 43:2738-44 (2000)  
Target
Name:
Bifunctional dihydrofolate reductase-thymidylate synthase
Synonyms:
Dihydrofolate Reductase-Thymidylate Synthase (DHFR-TS) Mutant KICB1
Type:
Mol. Mass.:
71741.43
Organism:
Plasmodium falciparum
Description:
Residue:
608
  
Inhibitor
Name:
BDBM50090068
Synonyms:
6-Phenyl-1-p-tolyl-1,6-dihydro-[1,3,5]triazine-2,4-diamine | CHEMBL91345
Type:
Small organic molecule
Emp. Form.:
C16H17N5
Mol. Mass.:
279.3397
SMILES:
Cc1ccc(cc1)N1C(N=C(N)N=C1N)c1ccccc1
: