Target
Bifunctional dihydrofolate reductase-thymidylate synthase [A16V,S108T]
Ligand
BDBM50090069
Substrate
Meas. Tech.
ChEMBL_138494 (CHEMBL749723)
Ki
130.7±n/a nM
Citation
 Yuthavong, YVilaivan, TChareonsethakul, NKamchonwongpaisan, SSirawaraporn, WQuarrell, RLowe, G Development of a lead inhibitor for the A16V+S108T mutant of dihydrofolate reductase from the cycloguanil-resistant strain (T9/94) of Plasmodium falciparum. J Med Chem 43:2738-44 (2000)  
Target
Name:
Bifunctional dihydrofolate reductase-thymidylate synthase [A16V,S108T]
Synonyms:
Dihydrofolate Reductase-Thymidylate Synthase (DHFR-TS) Mutant A16V, S108T
Type:
Mol. Mass.:
71783.51
Organism:
Plasmodium falciparum
Description:
Q8I1R6[A16V,S108T]
Residue:
608
  
Inhibitor
Name:
BDBM50090069
Synonyms:
1-(3,4-Dichloro-phenyl)-6,6-dimethyl-1,6-dihydro-[1,3,5]triazine-2,4-diamine | CHEMBL92583
Type:
Small organic molecule
Emp. Form.:
C11H13Cl2N5
Mol. Mass.:
286.16
SMILES:
CC1(C)N=C(N)N=C(N)N1c1ccc(Cl)c(Cl)c1
: