Target
Bifunctional dihydrofolate reductase-thymidylate synthase
Ligand
BDBM50090075
Substrate
Meas. Tech.
ChEMBL_216586 (CHEMBL821378)
Ki
1.1±n/a nM
Citation
 Yuthavong, YVilaivan, TChareonsethakul, NKamchonwongpaisan, SSirawaraporn, WQuarrell, RLowe, G Development of a lead inhibitor for the A16V+S108T mutant of dihydrofolate reductase from the cycloguanil-resistant strain (T9/94) of Plasmodium falciparum. J Med Chem 43:2738-44 (2000)  
Target
Name:
Bifunctional dihydrofolate reductase-thymidylate synthase
Synonyms:
Dihydrofolate Reductase-Thymidylate Synthase (DHFR-TS) Mutant KICB1
Type:
Mol. Mass.:
71741.43
Organism:
Plasmodium falciparum
Description:
Residue:
608
  
Inhibitor
Name:
BDBM50090075
Synonyms:
1-(4-Bromo-phenyl)-6,6-dimethyl-1,6-dihydro-[1,3,5]triazine-2,4-diamine | CHEMBL6741
Type:
Small organic molecule
Emp. Form.:
C11H14BrN5
Mol. Mass.:
296.166
SMILES:
CC1(C)N=C(N)N=C(N)N1c1ccc(Br)cc1
: