Target
Bifunctional dihydrofolate reductase-thymidylate synthase
Ligand
BDBM50090066
Substrate
Meas. Tech.
ChEMBL_216586 (CHEMBL821378)
Ki
5.7±n/a nM
Citation
 Yuthavong, YVilaivan, TChareonsethakul, NKamchonwongpaisan, SSirawaraporn, WQuarrell, RLowe, G Development of a lead inhibitor for the A16V+S108T mutant of dihydrofolate reductase from the cycloguanil-resistant strain (T9/94) of Plasmodium falciparum. J Med Chem 43:2738-44 (2000)  
Target
Name:
Bifunctional dihydrofolate reductase-thymidylate synthase
Synonyms:
Dihydrofolate Reductase-Thymidylate Synthase (DHFR-TS) Mutant KICB1
Type:
Mol. Mass.:
71741.43
Organism:
Plasmodium falciparum
Description:
Residue:
608
  
Inhibitor
Name:
BDBM50090066
Synonyms:
1-(4-Bromo-phenyl)-6-methyl-1,6-dihydro-[1,3,5]triazine-2,4-diamine | CHEMBL93748
Type:
Small organic molecule
Emp. Form.:
C10H12BrN5
Mol. Mass.:
282.14
SMILES:
CC1N=C(N)N=C(N)N1c1ccc(Br)cc1
: