Target
Proton-coupled folate transporter
Ligand
BDBM50534427
Substrate
Meas. Tech.
ChEMBL_1928981 (CHEMBL4432157)
Ki
850±n/a nM
Citation
 Golani, LKWallace-Povirk, ADeis, SMWong, JKe, JGu, XRaghavan, SWilson, MRLi, XPolin, Lde Waal, PWWhite, KKushner, JO'Connor, CHou, ZXu, HEMelcher, KDann, CEMatherly, LHGangjee, A Tumor Targeting with Novel 6-Substituted Pyrrolo [2,3-d] Pyrimidine Antifolates with Heteroatom Bridge Substitutions via Cellular Uptake by Folate Receptor ? and the Proton-Coupled Folate Transporter and Inhibition of de Novo Purine Nucleotide Biosynthesis. J Med Chem 59:7856-76 (2016)  
Target
Name:
Proton-coupled folate transporter
Synonyms:
G21 Heme carrier protein 1 PCFT/HCP1 SLC46A1 | Solute carrier family 46 member 1
Type:
PROTEIN
Mol. Mass.:
49782.13
Organism:
Homo sapiens (Human)
Description:
ChEMBL_1469597
Residue:
459
  
Inhibitor
Name:
BDBM50534427
Synonyms:
CHEMBL4437824
Type:
Small organic molecule
Emp. Form.:
C20H22N6O6
Mol. Mass.:
442.4253
SMILES:
Nc1nc2[nH]c(CCNc3ccc(cc3)C(=O)N[C@@H](CCC(O)=O)C(O)=O)cc2c(=O)[nH]1
: