Target
Cannabinoid receptor 1
Ligand
BDBM50032599
Substrate
Meas. Tech.
ChEMBL_1929056 (CHEMBL4432232)
Ki
88±n/a nM
Citation
 Seltzman, HHShiner, CHirt, EEGilliam, AFThomas, BFMaitra, RSnyder, RBlack, SLPatel, PRMulpuri, YSpigelman, I Peripherally Selective Cannabinoid 1 Receptor (CB1R) Agonists for the Treatment of Neuropathic Pain. J Med Chem 59:7525-43 (2016)  
Target
Name:
Cannabinoid receptor 1
Synonyms:
CANN6 CB-R CNR CNR1_HUMAN Cannabinoid receptor Cannabinoid receptor 1 (brain)
Type:
G Protein-Coupled Receptor (GPCR)
Mol. Mass.:
52868.96
Organism:
Homo sapiens (Human)
Description:
P21554
Residue:
472
  
Inhibitor
Name:
BDBM50032599
Synonyms:
(4-Methoxy-naphthalen-1-yl)-[1-(2-morpholin-4-yl-ethyl)-1H-indol-3-yl]-methanone | CHEMBL81473
Type:
Small organic molecule
Emp. Form.:
C26H26N2O3
Mol. Mass.:
414.4962
SMILES:
COc1ccc(C(=O)c2cn(CCN3CCOCC3)c3ccccc23)c2ccccc12
: