Target
Urease subunit beta
Ligand
BDBM50493364
Substrate
Meas. Tech.
ChEMBL_1929073 (CHEMBL4432249)
Ki
1200±n/a nM
Citation
 Shi, WKDeng, RCWang, PFYue, QQLiu, QDing, KLYang, MHZhang, HYGong, SHDeng, MLiu, WRFeng, QJXiao, ZPZhu, HL 3-Arylpropionylhydroxamic acid derivatives as Helicobacter pylori urease inhibitors: Synthesis, molecular docking and biological evaluation. Bioorg Med Chem 24:4519-4527 (2016)  
Target
Name:
Urease subunit beta
Synonyms:
3.5.1.5 Urea amidohydrolase subunit beta hpuB | ureB
Type:
PROTEIN
Mol. Mass.:
61676.43
Organism:
Helicobacter pylori (strain ATCC 700392 / 26695) (Campylobacterpylori)
Description:
ChEMBL_117195
Residue:
569
  
Inhibitor
Name:
BDBM50493364
Synonyms:
CHEMBL2425480
Type:
Small organic molecule
Emp. Form.:
C9H10ClNO4
Mol. Mass.:
231.633
SMILES:
ONC(=O)CC(O)c1cc(Cl)ccc1O
: