Target
Alpha-1B adrenergic receptor
Ligand
BDBM50090312
Substrate
Meas. Tech.
ChEBML_34344
Ki
840±n/a nM
Citation
 Patane, MADiPardo, RMNewton, RCPrice, RPBroten, TPChang, RSRansom, RWDi Salvo, JNagarathnam, DForray, CGluchowski, CBock, MG Phenylacetamides as selective alpha-1A adrenergic receptor antagonists. Bioorg Med Chem Lett 10:1621-4 (2000)  
Target
Name:
Alpha-1B adrenergic receptor
Synonyms:
ADA1B_HUMAN Adrenergic alpha1B Adrenergic receptor alpha Alpha 1B-adrenoreceptor | Alpha-1B adrenergic receptor
Type:
Enzyme
Mol. Mass.:
56862.13
Organism:
Homo sapiens (Human)
Description:
P35368
Residue:
520
  
Inhibitor
Name:
BDBM50090312
Synonyms:
CHEMBL296965 | N-[3-(4-Cyano-4-phenyl-piperidin-1-yl)-propyl]-2,2-diphenyl-acetamide
Type:
Small organic molecule
Emp. Form.:
C29H31N3O
Mol. Mass.:
437.5759
SMILES:
O=C(NCCCN1CCC(CC1)(C#N)c1ccccc1)C(c1ccccc1)c1ccccc1
: