Target
Alpha-1A adrenergic receptor
Ligand
BDBM50090325
Substrate
Meas. Tech.
ChEBML_33730
Ki
8.8±n/a nM
Citation
 Patane, MADiPardo, RMNewton, RCPrice, RPBroten, TPChang, RSRansom, RWDi Salvo, JNagarathnam, DForray, CGluchowski, CBock, MG Phenylacetamides as selective alpha-1A adrenergic receptor antagonists. Bioorg Med Chem Lett 10:1621-4 (2000)  
Target
Name:
Alpha-1A adrenergic receptor
Synonyms:
ADA1A_HUMAN ADRA1C Alpha 1A-adrenoceptor Alpha adrenergic receptor 1a Alpha-adrenergic receptor 1c adrenergic Alpha1 | adrenergic Alpha1C
Type:
Cell-surface receptors
Mol. Mass.:
51511.67
Organism:
Homo sapiens (Human)
Description:
P35348
Residue:
466
  
Inhibitor
Name:
BDBM50090325
Synonyms:
CHEMBL295304 | N-[3-(4-Phenyl-piperidin-1-yl)-propyl]-2,2-di-p-tolyl-acetamide
Type:
Small organic molecule
Emp. Form.:
C30H36N2O
Mol. Mass.:
440.6196
SMILES:
Cc1ccc(cc1)C(C(=O)NCCCN1CCC(CC1)c1ccccc1)c1ccc(C)cc1
: