Target
Alpha-1A adrenergic receptor
Ligand
BDBM50090302
Substrate
Meas. Tech.
ChEBML_33730
Ki
61±n/a nM
Citation
 Patane, MADiPardo, RMNewton, RCPrice, RPBroten, TPChang, RSRansom, RWDi Salvo, JNagarathnam, DForray, CGluchowski, CBock, MG Phenylacetamides as selective alpha-1A adrenergic receptor antagonists. Bioorg Med Chem Lett 10:1621-4 (2000)  
Target
Name:
Alpha-1A adrenergic receptor
Synonyms:
ADA1A_HUMAN ADRA1C Alpha 1A-adrenoceptor Alpha adrenergic receptor 1a Alpha-adrenergic receptor 1c adrenergic Alpha1 | adrenergic Alpha1C
Type:
Cell-surface receptors
Mol. Mass.:
51511.67
Organism:
Homo sapiens (Human)
Description:
P35348
Residue:
466
  
Inhibitor
Name:
BDBM50090302
Synonyms:
CHEMBL40303 | N-[3-(4-Cyano-4-phenyl-piperidin-1-yl)-propyl]-2-cyclohexyl-2-phenyl-acetamide
Type:
Small organic molecule
Emp. Form.:
C29H37N3O
Mol. Mass.:
443.6236
SMILES:
O=C(NCCCN1CCC(CC1)(C#N)c1ccccc1)C(C1CCCCC1)c1ccccc1
: