Target
Alpha-1B adrenergic receptor
Ligand
BDBM50090323
Substrate
Meas. Tech.
ChEBML_34344
Ki
670±n/a nM
Citation
 Patane, MADiPardo, RMNewton, RCPrice, RPBroten, TPChang, RSRansom, RWDi Salvo, JNagarathnam, DForray, CGluchowski, CBock, MG Phenylacetamides as selective alpha-1A adrenergic receptor antagonists. Bioorg Med Chem Lett 10:1621-4 (2000)  
Target
Name:
Alpha-1B adrenergic receptor
Synonyms:
ADA1B_HUMAN Adrenergic alpha1B Adrenergic receptor alpha Alpha 1B-adrenoreceptor | Alpha-1B adrenergic receptor
Type:
Enzyme
Mol. Mass.:
56862.13
Organism:
Homo sapiens (Human)
Description:
P35368
Residue:
520
  
Inhibitor
Name:
BDBM50090323
Synonyms:
CHEMBL289916 | N-[3-(3',4',5',6'-Tetrahydro-2'H-[2,4']bipyridinyl-1'-yl)-propyl]-2,2-di-p-tolyl-acetamide
Type:
Small organic molecule
Emp. Form.:
C29H35N3O
Mol. Mass.:
441.6077
SMILES:
Cc1ccc(cc1)C(C(=O)NCCCN1CCC(CC1)c1ccccn1)c1ccc(C)cc1
: