Target
Alpha-1B adrenergic receptor
Ligand
BDBM50090314
Substrate
Meas. Tech.
ChEBML_34344
Ki
570±n/a nM
Citation
 Patane, MADiPardo, RMNewton, RCPrice, RPBroten, TPChang, RSRansom, RWDi Salvo, JNagarathnam, DForray, CGluchowski, CBock, MG Phenylacetamides as selective alpha-1A adrenergic receptor antagonists. Bioorg Med Chem Lett 10:1621-4 (2000)  
Target
Name:
Alpha-1B adrenergic receptor
Synonyms:
ADA1B_HUMAN Adrenergic alpha1B Adrenergic receptor alpha Alpha 1B-adrenoreceptor | Alpha-1B adrenergic receptor
Type:
Enzyme
Mol. Mass.:
56862.13
Organism:
Homo sapiens (Human)
Description:
P35368
Residue:
520
  
Inhibitor
Name:
BDBM50090314
Synonyms:
1-[3-(2,2-Di-p-tolyl-acetylamino)-propyl]-4-phenyl-piperidine-4-carboxylic acid amide | CHEMBL44288
Type:
Small organic molecule
Emp. Form.:
C31H37N3O2
Mol. Mass.:
483.6444
SMILES:
Cc1ccc(cc1)C(C(=O)NCCCN1CCC(CC1)(C(N)=O)c1ccccc1)c1ccc(C)cc1
: