Target
Alpha-1B adrenergic receptor
Ligand
BDBM50090304
Substrate
Meas. Tech.
ChEBML_34344
Ki
450±n/a nM
Citation
 Patane, MADiPardo, RMNewton, RCPrice, RPBroten, TPChang, RSRansom, RWDi Salvo, JNagarathnam, DForray, CGluchowski, CBock, MG Phenylacetamides as selective alpha-1A adrenergic receptor antagonists. Bioorg Med Chem Lett 10:1621-4 (2000)  
Target
Name:
Alpha-1B adrenergic receptor
Synonyms:
ADA1B_HUMAN Adrenergic alpha1B Adrenergic receptor alpha Alpha 1B-adrenoreceptor | Alpha-1B adrenergic receptor
Type:
Enzyme
Mol. Mass.:
56862.13
Organism:
Homo sapiens (Human)
Description:
P35368
Residue:
520
  
Inhibitor
Name:
BDBM50090304
Synonyms:
1-[3-(2,2-Di-p-tolyl-acetylamino)-propyl]-4-phenyl-piperidine-4-carboxylic acid methyl ester | CHEMBL41677
Type:
Small organic molecule
Emp. Form.:
C32H38N2O3
Mol. Mass.:
498.6557
SMILES:
COC(=O)C1(CCN(CCCNC(=O)C(c2ccc(C)cc2)c2ccc(C)cc2)CC1)c1ccccc1
: