Target
Alpha-1A adrenergic receptor
Ligand
BDBM50090319
Substrate
Meas. Tech.
ChEBML_33730
Ki
240±n/a nM
Citation
 Patane, MADiPardo, RMNewton, RCPrice, RPBroten, TPChang, RSRansom, RWDi Salvo, JNagarathnam, DForray, CGluchowski, CBock, MG Phenylacetamides as selective alpha-1A adrenergic receptor antagonists. Bioorg Med Chem Lett 10:1621-4 (2000)  
Target
Name:
Alpha-1A adrenergic receptor
Synonyms:
ADA1A_HUMAN ADRA1C Alpha 1A-adrenoceptor Alpha adrenergic receptor 1a Alpha-adrenergic receptor 1c adrenergic Alpha1 | adrenergic Alpha1C
Type:
Cell-surface receptors
Mol. Mass.:
51511.67
Organism:
Homo sapiens (Human)
Description:
P35348
Residue:
466
  
Inhibitor
Name:
BDBM50090319
Synonyms:
1-{3-[3-(4-Nitro-phenyl)-propionylamino]-propyl}-4-phenyl-piperidine-4-carboxylic acid methyl ester | CHEMBL42156
Type:
Small organic molecule
Emp. Form.:
C25H31N3O5
Mol. Mass.:
453.5307
SMILES:
COC(=O)C1(CCN(CCCNC(=O)CCc2ccc(cc2)[N+]([O-])=O)CC1)c1ccccc1
: