Target
Urease subunit beta
Ligand
BDBM50099857
Substrate
Meas. Tech.
ChEMBL_1929328 (CHEMBL4432504)
IC50
154000±n/a nM
Citation
 Macegoniuk, KGrela, EPalus, JRudzi?ska-Szostak, EGrabowiecka, ABiernat, MBerlicki, ? 1,2-Benzisoselenazol-3(2H)-one Derivatives As a New Class of Bacterial Urease Inhibitors. J Med Chem 59:8125-33 (2016)  
Target
Name:
Urease subunit beta
Synonyms:
3.5.1.5 Urea amidohydrolase subunit beta hpuB | ureB
Type:
PROTEIN
Mol. Mass.:
61676.43
Organism:
Helicobacter pylori (strain ATCC 700392 / 26695) (Campylobacterpylori)
Description:
ChEMBL_117195
Residue:
569
  
Inhibitor
Name:
BDBM50099857
Synonyms:
ACETOHYDROXAMIC ACID (AHA) Acethydroxamsaeure Acetic acid, oxime Cetohyroxamic acid Methylhydroxamic acid N-Acetylhydroxylamine acetohydroxamic acid
Type:
Small organic molecule
Emp. Form.:
C2H5NO2
Mol. Mass.:
75.0666
SMILES:
CC(=O)NO
: