Target
Botulinum neurotoxin type A
Ligand
BDBM23274
Substrate
Meas. Tech.
ChEMBL_1929500 (CHEMBL4432676)
IC50
410±n/a nM
Citation
 Zhou, YMcGillick, BETeng, YGHaranahalli, KOjima, ISwaminathan, SRizzo, RC Identification of small molecule inhibitors of botulinum neurotoxin serotype E via footprint similarity. Bioorg Med Chem 24:4875-4889 (2016)  
Target
Name:
Botulinum neurotoxin type A
Synonyms:
BXA1_CLOBO bonT | botA
Type:
PROTEIN
Mol. Mass.:
149450.01
Organism:
Clostridium botulinum
Description:
ChEMBL_1510137
Residue:
1296
  
Inhibitor
Name:
BDBM23274
Synonyms:
(2E)-3-(2,4-dichlorophenyl)-N-hydroxyprop-2-enamide BMCL176463 Compound 2 | Cinnamic hydroxamate deriv., 18
Type:
Small organic molecule
Emp. Form.:
C9H7Cl2NO2
Mol. Mass.:
232.063
SMILES:
ONC(=O)\C=C\c1ccc(Cl)cc1Cl
: