Target
Vitamin K epoxide reductase complex subunit 1
Ligand
BDBM50535486
Substrate
Meas. Tech.
ChEMBL_1930830 (CHEMBL4434081)
IC50
1929±n/a nM
Citation
 Xing, HHouston, SDChen, XJin, DYSavage, GPTie, JKWilliams, CM Determining the necessity of phenyl ring ?-character in warfarin. Bioorg Med Chem Lett 29:1954-1956 (2019)  
Target
Name:
Vitamin K epoxide reductase complex subunit 1
Synonyms:
VKOR VKORC1 Vitamin K epoxide reductase complex subunit 1 (hVKORC1) Vitamin k epoxide reductase complex subunit 1 isoform 1
Type:
Enzyme
Mol. Mass.:
18244.90
Organism:
Homo sapiens (Human)
Description:
Q9BQB6
Residue:
163
  
Inhibitor
Name:
BDBM50535486
Synonyms:
CHEMBL4463800
Type:
Small organic molecule
Emp. Form.:
C22H18O6
Mol. Mass.:
378.3747
SMILES:
CC(=O)CC(c1c(O)c2ccccc2oc1=O)/C1=C/C=C(\C=C/C=C\1)/C(O)=O
: