Target
Caspase-1
Ligand
BDBM50091566
Substrate
Meas. Tech.
ChEMBL_46497 (CHEMBL659500)
IC50
0.76±n/a nM
Citation
 Talanian, RVBrady, KDCryns, VL Caspases as targets for anti-inflammatory and anti-apoptotic drug discovery. J Med Chem 43:3351-71 (2000)  
Target
Name:
Caspase-1
Synonyms:
CASP1 Caspase ICE IL1BCE Interleukin-1 beta-converting enzyme
Type:
Enzyme
Mol. Mass.:
45154.13
Organism:
Homo sapiens (Human)
Description:
P29466
Residue:
404
  
Inhibitor
Name:
BDBM50091566
Synonyms:
3-(2-{2-[2-Acetylamino-3-(4-hydroxy-phenyl)-propionylamino]-3-methyl-butyrylamino}-propionylamino)-4-oxo-butyric acid | CHEMBL111839
Type:
Small organic molecule
Emp. Form.:
C23H32N4O8
Mol. Mass.:
492.5222
SMILES:
CC(C)[C@H](NC(=O)[C@H](Cc1ccc(O)cc1)NC(C)=O)C(=O)N[C@@H](C)C(=O)NC(CC(O)=O)C=O
: