Target
Proprotein convertase subtilisin/kexin type 9
Ligand
BDBM50535683
Substrate
Meas. Tech.
ChEMBL_1931025 (CHEMBL4434276)
IC50
250±n/a nM
Citation
 Winston-McPherson, GNXie, HYang, KLi, XShu, DTang, W Discovery of 2,3'-diindolylmethanes as a novel class of PCSK9 modulators. Bioorg Med Chem Lett 29:2345-2348 (2019)  
Target
Name:
Proprotein convertase subtilisin/kexin type 9
Synonyms:
NARC-1 Neural apoptosis-regulated convertase 1 PCSK9 Proprotein convertase 9 Proprotein convertase subtilisin/kexin type 9 (PCSK9) Subtilisin/kexin-like protease PC9
Type:
Enzyme
Mol. Mass.:
74286.93
Organism:
Homo sapiens (Human)
Description:
Q8NBP7
Residue:
692
  
Inhibitor
Name:
BDBM50535683
Synonyms:
CHEMBL4549362
Type:
Small organic molecule
Emp. Form.:
C17H12ClFN2
Mol. Mass.:
298.742
SMILES:
Fc1ccc2[nH]c(Cc3c[nH]c4c(Cl)cccc34)cc2c1
: