Target
Proprotein convertase subtilisin/kexin type 9
Ligand
BDBM50535687
Substrate
Meas. Tech.
ChEMBL_1931025 (CHEMBL4434276)
IC50
1400±n/a nM
Citation
 Winston-McPherson, GNXie, HYang, KLi, XShu, DTang, W Discovery of 2,3'-diindolylmethanes as a novel class of PCSK9 modulators. Bioorg Med Chem Lett 29:2345-2348 (2019)  
Target
Name:
Proprotein convertase subtilisin/kexin type 9
Synonyms:
NARC-1 Neural apoptosis-regulated convertase 1 PCSK9 Proprotein convertase 9 Proprotein convertase subtilisin/kexin type 9 (PCSK9) Subtilisin/kexin-like protease PC9
Type:
Enzyme
Mol. Mass.:
74286.93
Organism:
Homo sapiens (Human)
Description:
Q8NBP7
Residue:
692
  
Inhibitor
Name:
BDBM50535687
Synonyms:
CHEMBL4435394
Type:
Small organic molecule
Emp. Form.:
C18H16N2
Mol. Mass.:
260.333
SMILES:
Cc1ccc2c(Cc3cc4ccccc4[nH]3)c[nH]c2c1
: