Target
Proprotein convertase subtilisin/kexin type 9
Ligand
BDBM50535690
Substrate
Meas. Tech.
ChEMBL_1931025 (CHEMBL4434276)
IC50
1100±n/a nM
Citation
 Winston-McPherson, GNXie, HYang, KLi, XShu, DTang, W Discovery of 2,3'-diindolylmethanes as a novel class of PCSK9 modulators. Bioorg Med Chem Lett 29:2345-2348 (2019)  
Target
Name:
Proprotein convertase subtilisin/kexin type 9
Synonyms:
NARC-1 Neural apoptosis-regulated convertase 1 PCSK9 Proprotein convertase 9 Proprotein convertase subtilisin/kexin type 9 (PCSK9) Subtilisin/kexin-like protease PC9
Type:
Enzyme
Mol. Mass.:
74286.93
Organism:
Homo sapiens (Human)
Description:
Q8NBP7
Residue:
692
  
Inhibitor
Name:
BDBM50535690
Synonyms:
CHEMBL4528279
Type:
Small organic molecule
Emp. Form.:
C28H28N2O2S
Mol. Mass.:
456.599
SMILES:
CC(C)c1c(Cc2cn(C)c3ccccc23)n(c2ccccc12)S(=O)(=O)c1ccc(C)cc1
: