Target
Proprotein convertase subtilisin/kexin type 9
Ligand
BDBM50535691
Substrate
Meas. Tech.
ChEMBL_1931025 (CHEMBL4434276)
IC50
2300±n/a nM
Citation
 Winston-McPherson, GNXie, HYang, KLi, XShu, DTang, W Discovery of 2,3'-diindolylmethanes as a novel class of PCSK9 modulators. Bioorg Med Chem Lett 29:2345-2348 (2019)  
Target
Name:
Proprotein convertase subtilisin/kexin type 9
Synonyms:
NARC-1 Neural apoptosis-regulated convertase 1 PCSK9 Proprotein convertase 9 Proprotein convertase subtilisin/kexin type 9 (PCSK9) Subtilisin/kexin-like protease PC9
Type:
Enzyme
Mol. Mass.:
74286.93
Organism:
Homo sapiens (Human)
Description:
Q8NBP7
Residue:
692
  
Inhibitor
Name:
BDBM50535691
Synonyms:
CHEMBL4461546
Type:
Small organic molecule
Emp. Form.:
C25H21ClN2O2S
Mol. Mass.:
448.964
SMILES:
Cc1c(Cc2c[nH]c3c(Cl)cccc23)n(c2ccccc12)S(=O)(=O)c1ccc(C)cc1
: