Target
Proprotein convertase subtilisin/kexin type 9
Ligand
BDBM50535693
Substrate
Meas. Tech.
ChEMBL_1931024 (CHEMBL4434275)
IC50
202±n/a nM
Citation
 Winston-McPherson, GNXie, HYang, KLi, XShu, DTang, W Discovery of 2,3'-diindolylmethanes as a novel class of PCSK9 modulators. Bioorg Med Chem Lett 29:2345-2348 (2019)  
Target
Name:
Proprotein convertase subtilisin/kexin type 9
Synonyms:
NARC-1 Neural apoptosis-regulated convertase 1 PCSK9 Proprotein convertase 9 Proprotein convertase subtilisin/kexin type 9 (PCSK9) Subtilisin/kexin-like protease PC9
Type:
Enzyme
Mol. Mass.:
74286.93
Organism:
Homo sapiens (Human)
Description:
Q8NBP7
Residue:
692
  
Inhibitor
Name:
BDBM50535693
Synonyms:
CHEMBL4572783
Type:
Small organic molecule
Emp. Form.:
C17H12F2N2
Mol. Mass.:
282.2874
SMILES:
Fc1ccc2[nH]c(Cc3c[nH]c4c(F)cccc34)cc2c1
: