Target
Serine palmitoyltransferase 1
Ligand
BDBM50535847
Substrate
Meas. Tech.
ChEMBL_1932328 (CHEMBL4477980)
IC50
64±n/a nM
Citation
 Genin, MJGonzalez Valcarcel, ICHolloway, WGLamar, JMosior, MHawkins, EEstridge, TWeidner, JSeng, TYurek, DAdams, LAWeller, JReynolds, VLBrozinick, JT Imidazopyridine and Pyrazolopiperidine Derivatives as Novel Inhibitors of Serine Palmitoyl Transferase. J Med Chem 59:5904-10 (2016)  
Target
Name:
Serine palmitoyltransferase 1
Synonyms:
LCB 1 Long chain base biosynthesis protein 1 SPT1 SPTLC1 | Serine-palmitoyl-CoA transferase 1
Type:
PROTEIN
Mol. Mass.:
52739.30
Organism:
Homo sapiens (Human)
Description:
ChEMBL_660503
Residue:
473
  
Inhibitor
Name:
BDBM50535847
Synonyms:
CHEMBL4541898
Type:
Small organic molecule
Emp. Form.:
C24H33N3O3
Mol. Mass.:
411.5371
SMILES:
CCCCCCC(=O)N1CCc2c(C1)c(nn2C)-c1ccc(cc1)C(C)(C)C(O)=O
: