Target
Endothelin-converting enzyme 1
Ligand
BDBM50091888
Substrate
Meas. Tech.
ChEBML_64202
IC50
19±n/a nM
Citation
 Fink, CAMoskal, MFirooznia, FHoyer, DSymonsbergen, DWei, DQiao, YSavage, PBeil, METrapani, AJJeng, AY Design and synthesis of potent thiol-based inhibitors of endothelin converting enzyme-1. Bioorg Med Chem Lett 10:2037-9 (2001)  
Target
Name:
Endothelin-converting enzyme 1
Synonyms:
ECE-1 ECE1_HUMAN Endothelin-converting enzyme 1 (ECE1)
Type:
Enzyme
Mol. Mass.:
87155.11
Organism:
Homo sapiens (Human)
Description:
P42892
Residue:
770
  
Inhibitor
Name:
BDBM50091888
Synonyms:
(S)-3-Biphenyl-4-yl-2-{[1-((S)-2-mercapto-4-methyl-pentanoylamino)-cyclopentanecarbonyl]-amino}-propionic acid | CHEMBL61269
Type:
Small organic molecule
Emp. Form.:
C27H34N2O4S
Mol. Mass.:
482.635
SMILES:
CC(C)C[C@H](S)C(=O)NC1(CCCC1)C(=O)N[C@@H](Cc1ccc(cc1)-c1ccccc1)C(O)=O
: