Target
D(4) dopamine receptor
Ligand
BDBM50092053
Substrate
Meas. Tech.
ChEBML_60689
Ki
1.6±n/a nM
Citation
 Zhao, HThurkauf, ABraun, JBrodbeck, RKieltyka, A Design, synthesis, and discovery of 3-piperazinyl-3,4-dihydro-2(1H)-quinolinone derivatives: a novel series of mixed dopamine D2/D4 receptor antagonists. Bioorg Med Chem Lett 10:2119-22 (2000)  
Target
Name:
D(4) dopamine receptor
Synonyms:
D(2C) dopamine receptor DOPAMINE D4.2 DRD4 Dopamine D4 receptor
Type:
Enzyme
Mol. Mass.:
48373.19
Organism:
Homo sapiens (Human)
Description:
P21917
Residue:
419
  
Inhibitor
Name:
BDBM50092053
Synonyms:
2-[4-(4-Chloro-benzyl)-piperazin-1-yl]-1-(2,3-dihydro-indol-1-yl)-ethanone | CHEMBL69584
Type:
Small organic molecule
Emp. Form.:
C21H24ClN3O
Mol. Mass.:
369.888
SMILES:
Clc1ccc(CN2CCN(CC(=O)N3CCc4ccccc34)CC2)cc1
: