Target
Serine/threonine-protein kinase TAO2
Ligand
BDBM50536311
Substrate
Meas. Tech.
ChEMBL_1933645 (CHEMBL4479297)
IC50
1000±n/a nM
Citation
 Piala, ATAkella, RPotts, MBDudics-Giagnocavo, SAHe, HWei, SWhite, MAPosner, BAGoldsmith, EJ Discovery of novel TAOK2 inhibitor scaffolds from high-throughput screening. Bioorg Med Chem Lett 26:3923-7 (2016)  
Target
Name:
Serine/threonine-protein kinase TAO2
Synonyms:
2.7.11.1 TAOK2_RAT Taok2 | Thousand and one amino acid protein 2
Type:
PROTEIN
Mol. Mass.:
138761.39
Organism:
Rattus norvegicus
Description:
ChEMBL_119215
Residue:
1235
  
Inhibitor
Name:
BDBM50536311
Synonyms:
CHEMBL4593946
Type:
Small organic molecule
Emp. Form.:
C23H20N2O4S2
Mol. Mass.:
452.546
SMILES:
CN1C(NC(=O)c2ccc(cc2)C(=O)c2ccccc2)Sc2cc(ccc12)S(C)(=O)=O
: