Target
Serine/threonine-protein kinase TAO2
Ligand
BDBM50536317
Substrate
Meas. Tech.
ChEMBL_1933645 (CHEMBL4479297)
IC50
3100±n/a nM
Citation
 Piala, ATAkella, RPotts, MBDudics-Giagnocavo, SAHe, HWei, SWhite, MAPosner, BAGoldsmith, EJ Discovery of novel TAOK2 inhibitor scaffolds from high-throughput screening. Bioorg Med Chem Lett 26:3923-7 (2016)  
Target
Name:
Serine/threonine-protein kinase TAO2
Synonyms:
2.7.11.1 TAOK2_RAT Taok2 | Thousand and one amino acid protein 2
Type:
PROTEIN
Mol. Mass.:
138761.39
Organism:
Rattus norvegicus
Description:
ChEMBL_119215
Residue:
1235
  
Inhibitor
Name:
BDBM50536317
Synonyms:
CHEMBL4585396
Type:
Small organic molecule
Emp. Form.:
C13H11ClN4S2
Mol. Mass.:
322.836
SMILES:
Cc1nc(N)sc1-c1csc(Nc2cccc(Cl)c2)n1
: