Target
Serine/threonine-protein kinase TAO2
Ligand
BDBM42286
Substrate
Meas. Tech.
ChEMBL_1933645 (CHEMBL4479297)
IC50
1000±n/a nM
Citation
 Piala, ATAkella, RPotts, MBDudics-Giagnocavo, SAHe, HWei, SWhite, MAPosner, BAGoldsmith, EJ Discovery of novel TAOK2 inhibitor scaffolds from high-throughput screening. Bioorg Med Chem Lett 26:3923-7 (2016)  
Target
Name:
Serine/threonine-protein kinase TAO2
Synonyms:
2.7.11.1 TAOK2_RAT Taok2 | Thousand and one amino acid protein 2
Type:
PROTEIN
Mol. Mass.:
138761.39
Organism:
Rattus norvegicus
Description:
ChEMBL_119215
Residue:
1235
  
Inhibitor
Name:
BDBM42286
Synonyms:
5-[2-(2,5-dimethoxyanilino)-1,3-thiazol-4-yl]-4-methyl-1,3-thiazol-2-amine 5-[2-[(2,5-dimethoxyphenyl)amino]-1,3-thiazol-4-yl]-4-methyl-1,3-thiazol-2-amine N*2*-(2,5-Dimethoxy-phenyl)-4'-methyl-[4,5']bithiazolyl-2,2'-diamine [4-(2-amino-4-methyl-thiazol-5-yl)thiazol-2-yl]-(2,5-dimethoxyphenyl)amine | cid_654122
Type:
Small organic molecule
Emp. Form.:
C15H16N4O2S2
Mol. Mass.:
348.443
SMILES:
COc1ccc(OC)c(Nc2nc(cs2)-c2sc(N)nc2C)c1
: