Target
Serine/threonine-protein kinase TAO2
Ligand
BDBM50536331
Substrate
Meas. Tech.
ChEMBL_1933645 (CHEMBL4479297)
IC50
3000±n/a nM
Citation
 Piala, ATAkella, RPotts, MBDudics-Giagnocavo, SAHe, HWei, SWhite, MAPosner, BAGoldsmith, EJ Discovery of novel TAOK2 inhibitor scaffolds from high-throughput screening. Bioorg Med Chem Lett 26:3923-7 (2016)  
Target
Name:
Serine/threonine-protein kinase TAO2
Synonyms:
2.7.11.1 TAOK2_RAT Taok2 | Thousand and one amino acid protein 2
Type:
PROTEIN
Mol. Mass.:
138761.39
Organism:
Rattus norvegicus
Description:
ChEMBL_119215
Residue:
1235
  
Inhibitor
Name:
BDBM50536331
Synonyms:
CHEMBL4553877
Type:
Small organic molecule
Emp. Form.:
C24H14N2O5
Mol. Mass.:
410.3784
SMILES:
OC(=O)c1cc(nc2ccc3ccccc3c12)-c1ccc(o1)-c1ccccc1[N+]([O-])=O
: