Target
Serine/threonine-protein kinase TAO2
Ligand
BDBM50536334
Substrate
Meas. Tech.
ChEMBL_1933644 (CHEMBL4479296)
IC50
1300±n/a nM
Citation
 Piala, ATAkella, RPotts, MBDudics-Giagnocavo, SAHe, HWei, SWhite, MAPosner, BAGoldsmith, EJ Discovery of novel TAOK2 inhibitor scaffolds from high-throughput screening. Bioorg Med Chem Lett 26:3923-7 (2016)  
Target
Name:
Serine/threonine-protein kinase TAO2
Synonyms:
2.7.11.1 TAOK2_RAT Taok2 | Thousand and one amino acid protein 2
Type:
PROTEIN
Mol. Mass.:
138761.39
Organism:
Rattus norvegicus
Description:
ChEMBL_119215
Residue:
1235
  
Inhibitor
Name:
BDBM50536334
Synonyms:
CHEMBL3715362
Type:
Small organic molecule
Emp. Form.:
C23H25N3O5S
Mol. Mass.:
455.527
SMILES:
CCOCCCn1c(=S)[nH]c2cc(ccc2c1=O)C(=O)NCC1COc2ccccc2O1
: