Target
Serine/threonine-protein kinase TAO2
Ligand
BDBM50536335
Substrate
Meas. Tech.
ChEMBL_1933645 (CHEMBL4479297)
IC50
1000±n/a nM
Citation
 Piala, ATAkella, RPotts, MBDudics-Giagnocavo, SAHe, HWei, SWhite, MAPosner, BAGoldsmith, EJ Discovery of novel TAOK2 inhibitor scaffolds from high-throughput screening. Bioorg Med Chem Lett 26:3923-7 (2016)  
Target
Name:
Serine/threonine-protein kinase TAO2
Synonyms:
2.7.11.1 TAOK2_RAT Taok2 | Thousand and one amino acid protein 2
Type:
PROTEIN
Mol. Mass.:
138761.39
Organism:
Rattus norvegicus
Description:
ChEMBL_119215
Residue:
1235
  
Inhibitor
Name:
BDBM50536335
Synonyms:
CHEMBL4563650
Type:
Small organic molecule
Emp. Form.:
C23H19N3O5S
Mol. Mass.:
449.479
SMILES:
O=C(NCC1COc2ccccc2O1)c1ccc2c(c1)[nH]c(=S)n(Cc1ccco1)c2=O
: