Target
Serine/threonine-protein kinase TAO2
Ligand
BDBM50536351
Substrate
Meas. Tech.
ChEMBL_1933645 (CHEMBL4479297)
IC50
1900±n/a nM
Citation
 Piala, ATAkella, RPotts, MBDudics-Giagnocavo, SAHe, HWei, SWhite, MAPosner, BAGoldsmith, EJ Discovery of novel TAOK2 inhibitor scaffolds from high-throughput screening. Bioorg Med Chem Lett 26:3923-7 (2016)  
Target
Name:
Serine/threonine-protein kinase TAO2
Synonyms:
2.7.11.1 TAOK2_RAT Taok2 | Thousand and one amino acid protein 2
Type:
PROTEIN
Mol. Mass.:
138761.39
Organism:
Rattus norvegicus
Description:
ChEMBL_119215
Residue:
1235
  
Inhibitor
Name:
BDBM50536351
Synonyms:
CHEMBL4567734
Type:
Small organic molecule
Emp. Form.:
C24H27N3O2S2
Mol. Mass.:
453.62
SMILES:
O=C(NCCSCc1ccccc1)c1ccc2c(c1)[nH]c(=S)n(C1CCCCC1)c2=O
: