Target
Serine/threonine-protein kinase TAO2
Ligand
BDBM50536357
Substrate
Meas. Tech.
ChEMBL_1933645 (CHEMBL4479297)
IC50
1700±n/a nM
Citation
 Piala, ATAkella, RPotts, MBDudics-Giagnocavo, SAHe, HWei, SWhite, MAPosner, BAGoldsmith, EJ Discovery of novel TAOK2 inhibitor scaffolds from high-throughput screening. Bioorg Med Chem Lett 26:3923-7 (2016)  
Target
Name:
Serine/threonine-protein kinase TAO2
Synonyms:
2.7.11.1 TAOK2_RAT Taok2 | Thousand and one amino acid protein 2
Type:
PROTEIN
Mol. Mass.:
138761.39
Organism:
Rattus norvegicus
Description:
ChEMBL_119215
Residue:
1235
  
Inhibitor
Name:
BDBM50536357
Synonyms:
CHEMBL4553536
Type:
Small organic molecule
Emp. Form.:
C19H23N5OS2
Mol. Mass.:
401.549
SMILES:
CCN(CC)c1ccc(Nc2nc(cs2)-c2sc(NC(C)=O)nc2C)cc1
: