Target
Histone-lysine N-methyltransferase EZH1
Ligand
BDBM50075071
Substrate
Meas. Tech.
ChEMBL_1933811 (CHEMBL4479463)
IC50
69±n/a nM
Citation
 Yang, XLi, FKonze, KDMeslamani, JMa, ABrown, PJZhou, MMArrowsmith, CHKaniskan, HÜVedadi, MJin, J Structure-Activity Relationship Studies for Enhancer of Zeste Homologue 2 (EZH2) and Enhancer of Zeste Homologue 1 (EZH1) Inhibitors. J Med Chem 59:7617-33 (2016)  
Target
Name:
Histone-lysine N-methyltransferase EZH1
Synonyms:
ENX-2 EZH1_HUMAN Enhancer of zeste homolog 1 (EZH1) KIAA0388
Type:
Protein
Mol. Mass.:
85285.34
Organism:
Homo sapiens (Human)
Description:
Q92800
Residue:
747
  
Inhibitor
Name:
BDBM50075071
Synonyms:
CHEMBL3414619
Type:
Small organic molecule
Emp. Form.:
C33H43N7O2
Mol. Mass.:
569.7402
SMILES:
CCCc1cc(C)[nH]c(=O)c1CNC(=O)c1cc(cc2n(ncc12)C(C)C)-c1ccc(nc1)N1CCN(CC1)C(C)C
: