Target
DNA (cytosine-5)-methyltransferase 1
Ligand
BDBM50443016
Substrate
Meas. Tech.
ChEMBL_1933901 (CHEMBL4479553)
IC50
0.300000±n/a nM
Citation
 Spurr, SSBayle, EDYu, WLi, FTempel, WVedadi, MSchapira, MFish, PV New small molecule inhibitors of histone methyl transferase DOT1L with a nitrile as a non-traditional replacement for heavy halogen atoms. Bioorg Med Chem Lett 26:4518-4522 (2016)  
Target
Name:
DNA (cytosine-5)-methyltransferase 1
Synonyms:
AIM CXXC9 DNA (cytosine-5)-methyltransferase 1 isoform b DNA methyltransferase HsaI DNMT1 M.HsaI | MCMT
Type:
Enzyme
Mol. Mass.:
183184.85
Organism:
Homo sapiens (Human)
Description:
P26358
Residue:
1616
  
Inhibitor
Name:
BDBM50443016
Synonyms:
CHEMBL3087498
Type:
Small organic molecule
Emp. Form.:
C28H40BrN7O4
Mol. Mass.:
618.566
SMILES:
CC(C)N(CCCNC(=O)Nc1ccc(cc1)C(C)(C)C)C[C@H]1O[C@H]([C@H](O)[C@@H]1O)n1cc(Br)c2c(N)ncnc12
: