Target
Cytoplasmic tyrosine-protein kinase BMX
Ligand
BDBM50536679
Substrate
Meas. Tech.
ChEMBL_1934046 (CHEMBL4479698)
IC50
3.5±n/a nM
Citation
 Sloman, DLNoucti, NAltman, MDChen, DMislak, ACSzewczak, AHayashi, MWarren, LDellovade, TWu, ZMarcus, JWalker, DSu, HPEdavettal, SCMunshi, SHutton, MNuthall, HStanton, MG Optimization of microtubule affinity regulating kinase (MARK) inhibitors with improved physical properties. Bioorg Med Chem Lett 26:4362-6 (2016)  
Target
Name:
Cytoplasmic tyrosine-protein kinase BMX
Synonyms:
BMX BMX_HUMAN Cytoplasmic tyrosine-protein kinase BMX (BMX) Epithelial and endothelial tyrosine kinase Tyrosine Kinase BMX | Tyrosine-protein kinase BMX/ETK
Type:
Tyrosine-protein kinase
Mol. Mass.:
78030.42
Organism:
Homo sapiens (Human)
Description:
P51813
Residue:
675
  
Inhibitor
Name:
BDBM50536679
Synonyms:
CHEMBL4568087
Type:
Small organic molecule
Emp. Form.:
C21H23N7OS
Mol. Mass.:
421.519
SMILES:
Cn1cc(cn1)-c1cnc2c(cnn2c1)-c1csc(c1)C(=O)N[C@@H]1CCCC[C@@H]1N
: