Target
Vascular endothelial growth factor receptor 2
Ligand
BDBM50536790
Substrate
Meas. Tech.
ChEMBL_1934534 (CHEMBL4480186)
IC50
>25000±n/a nM
Citation
 Lv, XHRen, ZLZhou, BGLi, QSChu, MJLiu, DHMo, KZhang, LSYao, XKCao, HQ Discovery of N-(benzyloxy)-1,3-diphenyl-1H-pyrazole-4-carboxamide derivatives as potential antiproliferative agents by inhibiting MEK. Bioorg Med Chem 24:4652-4659 (2016)  
Target
Name:
Vascular endothelial growth factor receptor 2
Synonyms:
CD_antigen=CD309 Fetal liver kinase 1 (FLK-1) KDR Protein-tyrosine kinase receptor Flk-1 VEGFR-2 VEGFR2 Vascular Endothelial Growth Factor Receptor Kinase 2 Vascular endothelial growth factor receptor 2 (KDR) Vascular endothelial growth factor receptor 2 (VEGFR2) Vascular endothelial growth factor receptor-2 (VEGFR-2)
Type:
Receptor Tyrosine Kinase
Mol. Mass.:
151510.97
Organism:
Homo sapiens (Human)
Description:
P35968
Residue:
1356
  
Inhibitor
Name:
BDBM50536790
Synonyms:
CHEMBL4575118
Type:
Small organic molecule
Emp. Form.:
C24H20FN3O2
Mol. Mass.:
401.4329
SMILES:
Cc1ccc(cc1)-c1nn(cc1C(=O)NOCc1ccccc1F)-c1ccccc1
: