Target
Dual specificity mitogen-activated protein kinase kinase 1
Ligand
BDBM50536790
Substrate
Meas. Tech.
ChEMBL_1934530 (CHEMBL4480182)
IC50
610±n/a nM
Citation
 Lv, XHRen, ZLZhou, BGLi, QSChu, MJLiu, DHMo, KZhang, LSYao, XKCao, HQ Discovery of N-(benzyloxy)-1,3-diphenyl-1H-pyrazole-4-carboxamide derivatives as potential antiproliferative agents by inhibiting MEK. Bioorg Med Chem 24:4652-4659 (2016)  
Target
Name:
Dual specificity mitogen-activated protein kinase kinase 1
Synonyms:
Dual specificity mitogen-activated protein kinase (MEK) Dual specificity mitogen-activated protein kinase kinase 1 (MEK1) Dual specificity mitogen-activated protein kinase kinase MEK1/2 MAP kinase kinase 1 MAPK/ERK kinase 1 MEK-1 MP2K1_HUMAN PRKMK1 | VHL-MAP2K1/MAP2K2
Type:
Other Protein Type
Mol. Mass.:
43439.03
Organism:
Homo sapiens (Human)
Description:
Full-length human MEK-1 was generated by PCR and purified as a fusion protein from Escherichia coli lysates.
Residue:
393
  
Inhibitor
Name:
BDBM50536790
Synonyms:
CHEMBL4575118
Type:
Small organic molecule
Emp. Form.:
C24H20FN3O2
Mol. Mass.:
401.4329
SMILES:
Cc1ccc(cc1)-c1nn(cc1C(=O)NOCc1ccccc1F)-c1ccccc1
: