Target
Receptor tyrosine-protein kinase erbB-2
Ligand
BDBM50536790
Substrate
Meas. Tech.
ChEMBL_1934533 (CHEMBL4480185)
IC50
>25000±n/a nM
Citation
 Lv, XHRen, ZLZhou, BGLi, QSChu, MJLiu, DHMo, KZhang, LSYao, XKCao, HQ Discovery of N-(benzyloxy)-1,3-diphenyl-1H-pyrazole-4-carboxamide derivatives as potential antiproliferative agents by inhibiting MEK. Bioorg Med Chem 24:4652-4659 (2016)  
Target
Name:
Receptor tyrosine-protein kinase erbB-2
Synonyms:
2.7.10.1 CD_antigen=CD340 ERBB2_HUMAN FASN/HER2 HER2 MLN19 NEU Proto-oncogene Neu Tyrosine kinase-type cell surface receptor HER2 | p185erbB2
Type:
Mol. Mass.:
137894.47
Organism:
Homo sapiens (Human)
Description:
P04626
Residue:
1255
  
Inhibitor
Name:
BDBM50536790
Synonyms:
CHEMBL4575118
Type:
Small organic molecule
Emp. Form.:
C24H20FN3O2
Mol. Mass.:
401.4329
SMILES:
Cc1ccc(cc1)-c1nn(cc1C(=O)NOCc1ccccc1F)-c1ccccc1
: