Target
Nuclear receptor ROR-gamma
Ligand
BDBM50536812
Substrate
Meas. Tech.
ChEMBL_1934537 (CHEMBL4480189)
EC50
58±n/a nM
Citation
 René, OFauber, BPBarnard, AChapman, KDeng, YEidenschenk, CEverett, CGobbi, AJohnson, ARLa, HNorman, MSalmon, GSummerhill, SWong, H Discovery of oxa-sultams as RORc inverse agonists showing reduced lipophilicity, improved selectivity and favorable ADME properties. Bioorg Med Chem Lett 26:4455-4461 (2016)  
Target
Name:
Nuclear receptor ROR-gamma
Synonyms:
NR1F3 Nuclear receptor ROR-gamma (RORC) RAR-related orphan receptor C (RORc) RORG RZRG Retinoid-related orphan receptor-gamma (RORc)
Type:
Enzyme Catalytic Domain
Mol. Mass.:
58218.40
Organism:
Homo sapiens (Human)
Description:
P51449
Residue:
518
  
Inhibitor
Name:
BDBM50536812
Synonyms:
CHEMBL4582295
Type:
Small organic molecule
Emp. Form.:
C25H32FN3O4S
Mol. Mass.:
489.603
SMILES:
COc1cccc(c1)[C@H]1CC[C@H](C)N(Cc2ccc(cc2F)N2CCN(CC2)C(C)=O)S1(=O)=O
: